Target
Tyrosine-protein phosphatase non-receptor type 7
Ligand
BDBM34347
Substrate
Meas. Tech.
MOA HePTP Fluorescent secondary assay for identification of redox-state modulating compounds
IC50
108±n/a nM
Citation
 PubChem, PC MOA HePTP Fluorescent secondary assay for identification of redox-state modulating compounds PubChem Bioassay (2009)[AID] 
Target
Name:
Tyrosine-protein phosphatase non-receptor type 7
Synonyms:
He-PTP Hematopoietic protein-tyrosine phosphatase (HEPTP) PTPN7 Tyrosine-protein phosphatase non-receptor type 7 | Tyrosine-protein phosphatase non-receptor type 7 (HEPTP)
Type:
Protein
Mol. Mass.:
40530.79
Organism:
Homo sapiens (Human)
Description:
P35236
Residue:
360
  
Inhibitor
Name:
BDBM34347
Synonyms:
MLS000056753 [4-amino-3-(3-methylphenyl)-2-sulfanylidene-1,3-thiazol-5-yl]-(4-methylpiperazin-1-yl)methanone [4-amino-3-(m-tolyl)-2-thioxo-4-thiazolin-5-yl]-(4-methylpiperazino)methanone cid_3000187
Type:
Small organic molecule
Emp. Form.:
C16H20N4OS2
Mol. Mass.:
348.486
SMILES:
CN1CCN(CC1)C(=O)c1sc(=S)n(c1N)-c1cccc(C)c1
: