Target
Tyrosine-protein phosphatase non-receptor type 7
Ligand
BDBM46248
Substrate
Meas. Tech.
MOA HePTP Fluorescent secondary assay for identification of redox-state modulating compounds
IC50
13100±n/a nM
Citation
 PubChem, PC MOA HePTP Fluorescent secondary assay for identification of redox-state modulating compounds PubChem Bioassay (2009)[AID] 
Target
Name:
Tyrosine-protein phosphatase non-receptor type 7
Synonyms:
He-PTP Hematopoietic protein-tyrosine phosphatase (HEPTP) PTPN7 Tyrosine-protein phosphatase non-receptor type 7 | Tyrosine-protein phosphatase non-receptor type 7 (HEPTP)
Type:
Protein
Mol. Mass.:
40530.79
Organism:
Homo sapiens (Human)
Description:
P35236
Residue:
360
  
Inhibitor
Name:
BDBM46248
Synonyms:
(4E)-4-[(tert-butylamino)-mercapto-methylene]-2-methoxy-cyclohexa-2,5-dien-1-one (4E)-4-[(tert-butylamino)-sulfanyl-methylidene]-2-methoxy-cyclohexa-2,5-dien-1-one MLS-0412116.0001 | cid_44182130
Type:
Small organic molecule
Emp. Form.:
C12H17NO2S
Mol. Mass.:
239.334
SMILES:
COc1cc(ccc1O)C(=S)NC(C)(C)C
: