Target
Tyrosine-protein phosphatase non-receptor type 7
Ligand
BDBM46254
Substrate
Meas. Tech.
MOA HePTP Fluorescent secondary assay for identification of redox-state modulating compounds
IC50
31700±n/a nM
Citation
 PubChem, PC MOA HePTP Fluorescent secondary assay for identification of redox-state modulating compounds PubChem Bioassay (2009)[AID] 
Target
Name:
Tyrosine-protein phosphatase non-receptor type 7
Synonyms:
He-PTP Hematopoietic protein-tyrosine phosphatase (HEPTP) PTPN7 Tyrosine-protein phosphatase non-receptor type 7 | Tyrosine-protein phosphatase non-receptor type 7 (HEPTP)
Type:
Protein
Mol. Mass.:
40530.79
Organism:
Homo sapiens (Human)
Description:
P35236
Residue:
360
  
Inhibitor
Name:
BDBM46254
Synonyms:
MLS-0412124.0001 [1-(2-phenoxyethyl)indol-3-yl]-piperidin-1-yl-methanethione [1-(2-phenoxyethyl)indol-3-yl]-piperidino-methanethione | cid_44182135
Type:
Small organic molecule
Emp. Form.:
C22H24N2OS
Mol. Mass.:
364.504
SMILES:
S=C(N1CCCCC1)c1cn(CCOc2ccccc2)c2ccccc12
: