Target
Tyrosine-protein phosphatase non-receptor type 7
Ligand
BDBM46259
Substrate
Meas. Tech.
MOA HePTP Fluorescent secondary assay for identification of redox-state modulating compounds
IC50
86800±n/a nM
Citation
 PubChem, PC MOA HePTP Fluorescent secondary assay for identification of redox-state modulating compounds PubChem Bioassay (2009)[AID] 
Target
Name:
Tyrosine-protein phosphatase non-receptor type 7
Synonyms:
He-PTP Hematopoietic protein-tyrosine phosphatase (HEPTP) PTPN7 Tyrosine-protein phosphatase non-receptor type 7 | Tyrosine-protein phosphatase non-receptor type 7 (HEPTP)
Type:
Protein
Mol. Mass.:
40530.79
Organism:
Homo sapiens (Human)
Description:
P35236
Residue:
360
  
Inhibitor
Name:
BDBM46259
Synonyms:
MLS-0412134.0001 N-methyl-1-(2-phenoxyethyl)indole-3-carboxamide | cid_44182140
Type:
Small organic molecule
Emp. Form.:
C18H18N2O2
Mol. Mass.:
294.3477
SMILES:
CNC(=O)c1cn(CCOc2ccccc2)c2ccccc12
: