Target
Dual specificity protein phosphatase 3
Ligand
BDBM31731
Substrate
Meas. Tech.
MOA VHR1 Fluorescent secondary assay for identification of redox-state modulating compounds
IC50
6210±n/a nM
Citation
 PubChem, PC MOA VHR1 Fluorescent secondary assay for identification of redox-state modulating compounds PubChem Bioassay (2009)[AID] 
Target
Name:
Dual specificity protein phosphatase 3
Synonyms:
DUS3_HUMAN Dual specificity protein phosphatase (VHR) Dual specificity protein phosphatase VHR Tyrosine-protein phosphatase non-receptor type 1 | VHR
Type:
Hydrolase
Mol. Mass.:
20480.58
Organism:
Homo sapiens (Human)
Description:
Residue:
185
  
Inhibitor
Name:
BDBM31731
Synonyms:
4-[5-[(Z)-(1-ketothiazolo[3,2-a]benzimidazol-2-ylidene)methyl]-2-furyl]benzoic acid 4-[5-[(Z)-(1-oxo-2-thiazolo[3,2-a]benzimidazolylidene)methyl]-2-furanyl]benzoic acid MLS-0091939.0001 | cid_2243732
Type:
Small organic molecule
Emp. Form.:
C21H12N2O4S
Mol. Mass.:
388.396
SMILES:
OC(=O)c1ccc(cc1)-c1ccc(\C=c2/sc3nc4ccccc4n3c2=O)o1
: