Target
Dual specificity protein phosphatase 3
Ligand
BDBM31735
Substrate
Meas. Tech.
MOA VHR1 Fluorescent secondary assay for identification of redox-state modulating compounds
IC50
345±n/a nM
Citation
 PubChem, PC MOA VHR1 Fluorescent secondary assay for identification of redox-state modulating compounds PubChem Bioassay (2009)[AID] 
Target
Name:
Dual specificity protein phosphatase 3
Synonyms:
DUS3_HUMAN Dual specificity protein phosphatase (VHR) Dual specificity protein phosphatase VHR Tyrosine-protein phosphatase non-receptor type 1 | VHR
Type:
Hydrolase
Mol. Mass.:
20480.58
Organism:
Homo sapiens (Human)
Description:
Residue:
185
  
Inhibitor
Name:
BDBM31735
Synonyms:
(7Z)-3-bromanyl-7-(furan-2-ylmethylidene)-[1,3]thiazolo[4,5]imidazo[1,2-b]pyridin-8-one (7Z)-3-bromo-7-(2-furfurylidene)thiazolo[4,5]imidazo[1,2-b]pyridin-8-one MLS-0091940.0001 | cid_6456506
Type:
Small organic molecule
Emp. Form.:
C13H6BrN3O2S
Mol. Mass.:
348.175
SMILES:
Brc1cnc2c(c1)nc1s\c(=C/c3ccco3)c(=O)n21
: