Target
Dual specificity protein phosphatase 3
Ligand
BDBM46234
Substrate
Meas. Tech.
MOA VHR1 Fluorescent secondary assay for identification of redox-state modulating compounds
IC50
72400±n/a nM
Citation
 PubChem, PC MOA VHR1 Fluorescent secondary assay for identification of redox-state modulating compounds PubChem Bioassay (2009)[AID] 
Target
Name:
Dual specificity protein phosphatase 3
Synonyms:
DUS3_HUMAN Dual specificity protein phosphatase (VHR) Dual specificity protein phosphatase VHR Tyrosine-protein phosphatase non-receptor type 1 | VHR
Type:
Hydrolase
Mol. Mass.:
20480.58
Organism:
Homo sapiens (Human)
Description:
Residue:
185
  
Inhibitor
Name:
BDBM46234
Synonyms:
(4Z)-2-methoxy-4-[pyrrolidin-1-yl(sulfanyl)methylidene]cyclohexa-2,5-dien-1-one (4Z)-4-[mercapto(pyrrolidino)methylene]-2-methoxy-cyclohexa-2,5-dien-1-one cid_5389226
Type:
Small organic molecule
Emp. Form.:
C12H15NO2S
Mol. Mass.:
237.318
SMILES:
COc1cc(ccc1O)C(=S)N1CCCC1
: