Target
Dual specificity protein phosphatase 3
Ligand
BDBM46253
Substrate
Meas. Tech.
MOA VHR1 Fluorescent secondary assay for identification of redox-state modulating compounds
IC50
1390±n/a nM
Citation
 PubChem, PC MOA VHR1 Fluorescent secondary assay for identification of redox-state modulating compounds PubChem Bioassay (2009)[AID] 
Target
Name:
Dual specificity protein phosphatase 3
Synonyms:
DUS3_HUMAN Dual specificity protein phosphatase (VHR) Dual specificity protein phosphatase VHR Tyrosine-protein phosphatase non-receptor type 1 | VHR
Type:
Hydrolase
Mol. Mass.:
20480.58
Organism:
Homo sapiens (Human)
Description:
Residue:
185
  
Inhibitor
Name:
BDBM46253
Synonyms:
(4E)-4-[(cyclopentylamino)-mercapto-methylene]-2-methoxy-cyclohexa-2,5-dien-1-one (4E)-4-[(cyclopentylamino)-sulfanyl-methylidene]-2-methoxy-cyclohexa-2,5-dien-1-one MLS-0412122.0001 | cid_44182134
Type:
Small organic molecule
Emp. Form.:
C13H17NO2S
Mol. Mass.:
251.345
SMILES:
COc1cc(ccc1O)C(=S)NC1CCCC1
: