Target
Bcl-2-related protein A1
Ligand
BDBM33097
Substrate
Meas. Tech.
Confirmation dose response of hits from multiplexed high-throughput screen for small molecule regulators of Bcl-2 family protein interactions, specifically Bim-Bfl-1
EC50
170±n/a nM
Citation
 PubChem, PC Confirmation dose response of hits from multiplexed high-throughput screen for small molecule regulators of Bcl-2 family protein interactions, specifically Bim-Bfl-1 PubChem Bioassay (2009)[AID] 
Target
Name:
Bcl-2-related protein A1
Synonyms:
B2LA1_HUMAN BCL2L5 Bcl-2-like protein 5 HBPA1 Protein BFL-1 | Protein GRS
Type:
Apoptosis regulator protein
Mol. Mass.:
20130.01
Organism:
Homo sapiens (Human)
Description:
Residue:
175
  
Inhibitor
Name:
BDBM33097
Synonyms:
3-[[7-(1,3-benzothiazol-2-ylsulfanyl)-4-nitro-2,1,3-benzoxadiazol-5-yl]amino]propyl acetate MLS000521052 acetic acid 3-[[7-(1,3-benzothiazol-2-ylthio)-4-nitro-2,1,3-benzoxadiazol-5-yl]amino]propyl ester cid_11957209
Type:
Small organic molecule
Emp. Form.:
C18H15N5O5S2
Mol. Mass.:
445.472
SMILES:
CC(=O)OCCCNc1cc(Sc2nc3ccccc3s2)c2nonc2c1[N+]([O-])=O
: