Target
Bcl-2-like protein 2
Ligand
BDBM33188
Substrate
Meas. Tech.
Confirmation dose response of hits from multiplexed high-throughput screen for small molecule regulators of Bcl-2 family protein interactions, specifically Bim-Bcl-W
EC50
1310±n/a nM
Citation
 PubChem, PC Confirmation dose response of hits from multiplexed high-throughput screen for small molecule regulators of Bcl-2 family protein interactions, specifically Bim-Bcl-W PubChem Bioassay (2009)[AID] 
Target
Name:
Bcl-2-like protein 2
Synonyms:
Apoptosis regulator Bcl-W BCL-W BCLW Bcl2-L-2 | KIAA0271
Type:
Protein
Mol. Mass.:
20742.61
Organism:
Homo sapiens (Human)
Description:
Residue:
193
  
Inhibitor
Name:
BDBM33188
Synonyms:
2-({7-[(5-methyl-1,3,4-thiadiazol-2-yl)thio]-4-nitro-2,1,3-benzoxadiazol-5-yl}amino)ethanol 2-[[7-[(5-methyl-1,3,4-thiadiazol-2-yl)thio]-4-nitro-2,1,3-benzoxadiazol-5-yl]amino]ethanol MLS000674024 cid_16195158
Type:
Small organic molecule
Emp. Form.:
C11H10N6O4S2
Mol. Mass.:
354.365
SMILES:
Cc1nnc(Sc2cc(NCCO)c([N+]([O-])=O)c3nonc23)s1
: