Target
Bcl-2-like protein 2
Ligand
BDBM33196
Substrate
Meas. Tech.
Confirmation dose response of hits from multiplexed high-throughput screen for small molecule regulators of Bcl-2 family protein interactions, specifically Bim-Bcl-W
EC50
3350±n/a nM
Citation
 PubChem, PC Confirmation dose response of hits from multiplexed high-throughput screen for small molecule regulators of Bcl-2 family protein interactions, specifically Bim-Bcl-W PubChem Bioassay (2009)[AID] 
Target
Name:
Bcl-2-like protein 2
Synonyms:
Apoptosis regulator Bcl-W BCL-W BCLW Bcl2-L-2 | KIAA0271
Type:
Protein
Mol. Mass.:
20742.61
Organism:
Homo sapiens (Human)
Description:
Residue:
193
  
Inhibitor
Name:
BDBM33196
Synonyms:
MLS001013472 N-[3-(2-methoxyanilino)-1,4-dioxo-2-naphthalenyl]acetamide N-[3-[(2-methoxyphenyl)amino]-1,4-bis(oxidanylidene)naphthalen-2-yl]ethanamide cid_284927
Type:
Small organic molecule
Emp. Form.:
C19H16N2O4
Mol. Mass.:
336.3413
SMILES:
COc1ccccc1NC1=C(NC(C)=O)C(=O)c2ccccc2C1=O
: