Target
Amyloid-beta A4 precursor protein-binding family A member 1
Ligand
BDBM29622
Substrate
Meas. Tech.
uHTS Homogeneous Terbium Time-Resolved Fluorescence Resonance Energy Transfer (HTRF) Assay
IC50
1280±n/a nM
Citation
 PubChem, PC uHTS Homogeneous Terbium Time-Resolved Fluorescence Resonance Energy Transfer (HTRF) Assay PubChem Bioassay (2009)[AID] 
Target
Name:
Amyloid-beta A4 precursor protein-binding family A member 1
Synonyms:
APBA1_RAT Mint1 neuronal munc18-1 binding protein
Type:
Enzyme Catalytic Domain
Mol. Mass.:
92603.32
Organism:
Rattus norvegicus
Description:
gi_2625023
Residue:
839
  
Inhibitor
Name:
BDBM29622
Synonyms:
MLS000078195 cid_660761
Type:
Small organic molecule
Emp. Form.:
C25H19N5O2
Mol. Mass.:
421.4507
SMILES:
Cc1cc(C)cc(c1)-n1c2ncn(Cc3ccco3)c(=O)c2c2nc3ccccc3nc12
: