Target
Amyloid-beta A4 precursor protein-binding family A member 1
Ligand
BDBM51613
Substrate
Meas. Tech.
uHTS Homogeneous Terbium Time-Resolved Fluorescence Resonance Energy Transfer (HTRF) Assay
IC50
4100±n/a nM
Citation
 PubChem, PC uHTS Homogeneous Terbium Time-Resolved Fluorescence Resonance Energy Transfer (HTRF) Assay PubChem Bioassay (2009)[AID] 
Target
Name:
Amyloid-beta A4 precursor protein-binding family A member 1
Synonyms:
APBA1_RAT Mint1 neuronal munc18-1 binding protein
Type:
Enzyme Catalytic Domain
Mol. Mass.:
92603.32
Organism:
Rattus norvegicus
Description:
gi_2625023
Residue:
839
  
Inhibitor
Name:
BDBM51613
Synonyms:
2-(4-Amino-3-chloro-phenyl)-1H-benzoimidazol-5-ylamine 2-(4-azanyl-3-chloranyl-phenyl)-3H-benzimidazol-5-amine SMR000120213 cid_774879
Type:
Small organic molecule
Emp. Form.:
C13H11ClN4
Mol. Mass.:
258.706
SMILES:
Nc1ccc2nc([nH]c2c1)-c1ccc(N)c(Cl)c1
: