Target
Amyloid-beta A4 precursor protein-binding family A member 1
Ligand
BDBM46686
Substrate
Meas. Tech.
uHTS Homogeneous Terbium Time-Resolved Fluorescence Resonance Energy Transfer (HTRF) Assay
IC50
8070±n/a nM
Citation
 PubChem, PC uHTS Homogeneous Terbium Time-Resolved Fluorescence Resonance Energy Transfer (HTRF) Assay PubChem Bioassay (2009)[AID] 
Target
Name:
Amyloid-beta A4 precursor protein-binding family A member 1
Synonyms:
APBA1_RAT Mint1 neuronal munc18-1 binding protein
Type:
Enzyme Catalytic Domain
Mol. Mass.:
92603.32
Organism:
Rattus norvegicus
Description:
gi_2625023
Residue:
839
  
Inhibitor
Name:
BDBM46686
Synonyms:
(4-chlorodithiazol-5-ylidene)-phenyl-amine 4-chloro-N-phenyl-5-dithiazolimine MLS-0390833.0001 | cid_483860
Type:
Small organic molecule
Emp. Form.:
C8H5ClN2S2
Mol. Mass.:
228.722
SMILES:
Clc1nss\c1=N\c1ccccc1
: