Target
Amyloid-beta A4 precursor protein-binding family A member 1
Ligand
BDBM47669
Substrate
Meas. Tech.
uHTS Homogeneous Terbium Time-Resolved Fluorescence Resonance Energy Transfer (HTRF) Assay
IC50
12100±n/a nM
Citation
 PubChem, PC uHTS Homogeneous Terbium Time-Resolved Fluorescence Resonance Energy Transfer (HTRF) Assay PubChem Bioassay (2009)[AID] 
Target
Name:
Amyloid-beta A4 precursor protein-binding family A member 1
Synonyms:
APBA1_RAT Mint1 neuronal munc18-1 binding protein
Type:
Enzyme Catalytic Domain
Mol. Mass.:
92603.32
Organism:
Rattus norvegicus
Description:
gi_2625023
Residue:
839
  
Inhibitor
Name:
BDBM47669
Synonyms:
3-(2-{(E)-[1-(4-chlorophenyl)-2,5-dioxoimidazolidin-4-ylidene]methyl}-1H-pyrrol-1-yl)benzoic acid 3-[2-[(E)-[1-(4-chlorophenyl)-2,5-diketo-imidazolidin-4-ylidene]methyl]pyrrol-1-yl]benzoic acid 3-[2-[(E)-[1-(4-chlorophenyl)-2,5-dioxoimidazolidin-4-ylidene]methyl]pyrrol-1-yl]benzoic acid SMR000313306 | cid_6104167
Type:
Small organic molecule
Emp. Form.:
C21H14ClN3O4
Mol. Mass.:
407.807
SMILES:
OC(=O)c1cccc(c1)-n1cccc1C=C1NC(=O)N(C1=O)c1ccc(Cl)cc1
: