Target
Amyloid-beta A4 precursor protein-binding family A member 1
Ligand
BDBM33199
Substrate
Meas. Tech.
uHTS Homogeneous Terbium Time-Resolved Fluorescence Resonance Energy Transfer (HTRF) Assay
IC50
6210±n/a nM
Citation
 PubChem, PC uHTS Homogeneous Terbium Time-Resolved Fluorescence Resonance Energy Transfer (HTRF) Assay PubChem Bioassay (2009)[AID] 
Target
Name:
Amyloid-beta A4 precursor protein-binding family A member 1
Synonyms:
APBA1_RAT Mint1 neuronal munc18-1 binding protein
Type:
Enzyme Catalytic Domain
Mol. Mass.:
92603.32
Organism:
Rattus norvegicus
Description:
gi_2625023
Residue:
839
  
Inhibitor
Name:
BDBM33199
Synonyms:
3-benzyl-7-methyl-8-(5-methyl-2-furyl)xanthine 7-methyl-8-(5-methyl-2-furanyl)-3-(phenylmethyl)purine-2,6-dione MLS001007637 cid_4878679
Type:
Small organic molecule
Emp. Form.:
C18H16N4O3
Mol. Mass.:
336.3446
SMILES:
Cc1ccc(o1)-c1nc2n(Cc3ccccc3)c(=O)[nH]c(=O)c2n1C
: