Target
Amyloid-beta A4 precursor protein-binding family A member 1
Ligand
BDBM54753
Substrate
Meas. Tech.
uHTS Homogeneous Terbium Time-Resolved Fluorescence Resonance Energy Transfer (HTRF) Assay
IC50
30900±n/a nM
Citation
 PubChem, PC uHTS Homogeneous Terbium Time-Resolved Fluorescence Resonance Energy Transfer (HTRF) Assay PubChem Bioassay (2009)[AID] 
Target
Name:
Amyloid-beta A4 precursor protein-binding family A member 1
Synonyms:
APBA1_RAT Mint1 neuronal munc18-1 binding protein
Type:
Enzyme Catalytic Domain
Mol. Mass.:
92603.32
Organism:
Rattus norvegicus
Description:
gi_2625023
Residue:
839
  
Inhibitor
Name:
BDBM54753
Synonyms:
(E)-3-[3-(5-methyl-2-furanyl)-1-phenyl-4-pyrazolyl]-2-propenoic acid (E)-3-[3-(5-methylfuran-2-yl)-1-phenyl-pyrazol-4-yl]prop-2-enoic acid MLS000774474 cid_876610
Type:
Small organic molecule
Emp. Form.:
C17H14N2O3
Mol. Mass.:
294.3047
SMILES:
Cc1ccc(o1)-c1nn(cc1\C=C\C(O)=O)-c1ccccc1
: