Target
Amyloid-beta A4 precursor protein-binding family A member 1
Ligand
BDBM50646
Substrate
Meas. Tech.
uHTS Homogeneous Terbium Time-Resolved Fluorescence Resonance Energy Transfer (HTRF) Assay
IC50
30000±n/a nM
Citation
 PubChem, PC uHTS Homogeneous Terbium Time-Resolved Fluorescence Resonance Energy Transfer (HTRF) Assay PubChem Bioassay (2009)[AID] 
Target
Name:
Amyloid-beta A4 precursor protein-binding family A member 1
Synonyms:
APBA1_RAT Mint1 neuronal munc18-1 binding protein
Type:
Enzyme Catalytic Domain
Mol. Mass.:
92603.32
Organism:
Rattus norvegicus
Description:
gi_2625023
Residue:
839
  
Inhibitor
Name:
BDBM50646
Synonyms:
2-[4-[4-(2-carboxyanilino)-3-methoxy-phenyl]-2-methoxy-anilino]benzoic acid 2-[[4-[4-[(2-carboxyphenyl)amino]-3-methoxy-phenyl]-2-methoxy-phenyl]amino]benzoic acid Redoxal cid_72571
Type:
Small organic molecule
Emp. Form.:
C28H24N2O6
Mol. Mass.:
484.5
SMILES:
COc1cc(ccc1Nc1ccccc1C(O)=O)-c1ccc(Nc2ccccc2C(O)=O)c(OC)c1
: