Target
Amyloid-beta A4 precursor protein-binding family A member 1
Ligand
BDBM51263
Substrate
Meas. Tech.
uHTS Homogeneous Terbium Time-Resolved Fluorescence Resonance Energy Transfer (HTRF) Assay
IC50
25800±n/a nM
Citation
 PubChem, PC uHTS Homogeneous Terbium Time-Resolved Fluorescence Resonance Energy Transfer (HTRF) Assay PubChem Bioassay (2009)[AID] 
Target
Name:
Amyloid-beta A4 precursor protein-binding family A member 1
Synonyms:
APBA1_RAT Mint1 neuronal munc18-1 binding protein
Type:
Enzyme Catalytic Domain
Mol. Mass.:
92603.32
Organism:
Rattus norvegicus
Description:
gi_2625023
Residue:
839
  
Inhibitor
Name:
BDBM51263
Synonyms:
1,4-bis(oxidanyl)naphthalene-2,3-dicarbonitrile MLS000738191 cid_278573
Type:
Small organic molecule
Emp. Form.:
C12H6N2O2
Mol. Mass.:
210.1882
SMILES:
Oc1c(C#N)c(C#N)c(O)c2ccccc12
: