Target
Amyloid-beta A4 precursor protein-binding family A member 1
Ligand
BDBM50740
Substrate
Meas. Tech.
uHTS Homogeneous Terbium Time-Resolved Fluorescence Resonance Energy Transfer (HTRF) Assay
IC50
1530±n/a nM
Citation
 PubChem, PC uHTS Homogeneous Terbium Time-Resolved Fluorescence Resonance Energy Transfer (HTRF) Assay PubChem Bioassay (2009)[AID] 
Target
Name:
Amyloid-beta A4 precursor protein-binding family A member 1
Synonyms:
APBA1_RAT Mint1 neuronal munc18-1 binding protein
Type:
Enzyme Catalytic Domain
Mol. Mass.:
92603.32
Organism:
Rattus norvegicus
Description:
gi_2625023
Residue:
839
  
Inhibitor
Name:
BDBM50740
Synonyms:
1-[2-(3,4-dimethoxyphenyl)acetyl]-1,2,3,6-tetrahydropyridazine-3,6-dione 2-[2-(3,4-dimethoxyphenyl)acetyl]-1H-pyridazine-3,6-dione 2-homoveratroyl-1H-pyridazine-3,6-quinone SMR000457922 | cid_670962
Type:
Small organic molecule
Emp. Form.:
C14H14N2O5
Mol. Mass.:
290.2714
SMILES:
COc1ccc(CC(=O)n2[nH]c(=O)ccc2=O)cc1OC
: