Target
Plectin
Ligand
BDBM32021
Substrate
Meas. Tech.
HTS fluorescence polarization-based dose response confirmatory screen for the Siah-1 primary assay utilizing an alternative fluorophore, fluorescein-labeled plectin
IC50
32104.8±2210 nM
Citation
 PubChem, PC HTS fluorescence polarization-based dose response confirmatory screen for the Siah-1 primary assay utilizing an alternative fluorophore, fluorescein-labeled plectin PubChem Bioassay (2009)[AID] 
Target
Name:
Plectin
Synonyms:
PLEC PLEC_HUMAN | plectin 1
Type:
Enzyme Catalytic Domain
Mol. Mass.:
531740.96
Organism:
Homo sapiens (Human)
Description:
Q15149
Residue:
4684
  
Inhibitor
Name:
BDBM32021
Synonyms:
4,5-bis(oxidanyl)-9,10-bis(oxidanylidene)anthracene-2-carboxylic acid 4,5-dihydroxy-9,10-dioxo-2-anthracenecarboxylic acid MLS000069639 SMR000058210 US9238626, Rhein | cid_10168
Type:
Small organic molecule
Emp. Form.:
C15H8O6
Mol. Mass.:
284.2204
SMILES:
OC(=O)c1cc(O)c2C(=O)c3c(O)cccc3C(=O)c2c1
: