Target
Tyrosine-protein phosphatase non-receptor type 7
Ligand
BDBM54768
Substrate
Meas. Tech.
HTS HePTP Fluorescent Assay using OMFP substrate for In Vitro dose response studies
IC50
28580±0 nM
Citation
 PubChem, PC HTS HePTP Fluorescent Assay using OMFP substrate for In Vitro dose response studies PubChem Bioassay (2009)[AID] 
Target
Name:
Tyrosine-protein phosphatase non-receptor type 7
Synonyms:
He-PTP Hematopoietic protein-tyrosine phosphatase (HEPTP) PTPN7 Tyrosine-protein phosphatase non-receptor type 7 | Tyrosine-protein phosphatase non-receptor type 7 (HEPTP)
Type:
Protein
Mol. Mass.:
40530.79
Organism:
Homo sapiens (Human)
Description:
P35236
Residue:
360
  
Inhibitor
Name:
BDBM54768
Synonyms:
2-[3-[2-hydroxyethyl(dimethyl)ammonio]propanoylamino]-2-methyl-propane-1-sulfonate 2-[3-[2-hydroxyethyl(dimethyl)azaniumyl]propanoylamino]-2-methylpropane-1-sulfonate MLS000554255 US20230364057, Compound 42 | cid_1973720
Type:
Small organic molecule
Emp. Form.:
C11H24N2O5S
Mol. Mass.:
296.384
SMILES:
CC(C)(CS([O-])(=O)=O)NC(=O)CC[N+](C)(C)CCO
: