Target
Tyrosine-protein phosphatase non-receptor type 22
Ligand
BDBM46243
Substrate
Meas. Tech.
SAR LYP1 Fluorescent Assay using pCAP substrate for In Vitro dose response studies
IC50
>100000±n/a nM
Citation
 PubChem, PC SAR LYP1 Fluorescent Assay using pCAP substrate for In Vitro dose response studies PubChem Bioassay (2009)[AID] 
Target
Name:
Tyrosine-protein phosphatase non-receptor type 22
Synonyms:
3.1.3.48 LyP Lymphoid phosphatase (Lyp) PEST-domain phosphatase PTPN22 Tyrosine-protein phosphatase non-receptor type 22 (LYP) | tyrosine-protein phosphatase non-receptor type 22 isoform 1
Type:
Mol. Mass.:
91712.31
Organism:
Homo sapiens (Human)
Description:
Q9Y2R2
Residue:
807
  
Inhibitor
Name:
BDBM46243
Synonyms:
4-[[2-chloranyl-4-[(E)-2-cyano-2-(3-fluorophenyl)ethenyl]-6-ethoxy-phenoxy]methyl]benzoic acid 4-[[2-chloro-4-[(E)-2-cyano-2-(3-fluorophenyl)vinyl]-6-ethoxy-phenoxy]methyl]benzoic acid cid_2230267
Type:
Small organic molecule
Emp. Form.:
C25H19ClFNO4
Mol. Mass.:
451.874
SMILES:
CCOc1cc(\C=C(\C#N)c2cccc(F)c2)cc(Cl)c1OCc1ccc(cc1)C(O)=O
: