Target
Kappa-type opioid receptor
Ligand
BDBM54796
Substrate
Meas. Tech.
HTS Image-Based Screen for Selective Antagonists of the KOR Receptor
IC50
1124±194 nM
Citation
 PubChem, PC HTS Image-Based Screen for Selective Antagonists of the KOR Receptor PubChem Bioassay (2009)[AID] 
Target
Name:
Kappa-type opioid receptor
Synonyms:
K-OR-1 Kappa-opioid receptor (KOR) Kappa-type opioid receptor (KOR) OPIATE Kappa OPRK1 kappa opioid receptor (KOR)
Type:
G Protein-Coupled Receptor (GPCR)
Mol. Mass.:
42648.76
Organism:
Homo sapiens (Human)
Description:
P41145
Residue:
380
  
Inhibitor
Name:
BDBM54796
Synonyms:
MLS000028833 SMR000058953 | cid_25078009
Type:
Small organic molecule
Emp. Form.:
C66H86N18O12
Mol. Mass.:
1323.5024
SMILES:
CCNC(=O)C1CCCN1C(=O)C(CCCN=C(N)N)NC(=O)C(CC(C)C)NC(=O)C(Cc1cn(Cc2ccccc2)cn1)NC(=O)C(Cc1ccc(O)cc1)NC(=O)C(CO)NC(=O)C(Cc1c[nH]c2ccccc12)NC(=O)C(Cc1cnc[nH]1)NC(=O)C1CCC(=O)N1
: