Target
Kappa-type opioid receptor
Ligand
BDBM54800
Substrate
Meas. Tech.
HTS Image-Based Screen for Selective Antagonists of the KOR Receptor
IC50
17981±1360 nM
Citation
 PubChem, PC HTS Image-Based Screen for Selective Antagonists of the KOR Receptor PubChem Bioassay (2009)[AID] 
Target
Name:
Kappa-type opioid receptor
Synonyms:
K-OR-1 Kappa-opioid receptor (KOR) Kappa-type opioid receptor (KOR) OPIATE Kappa OPRK1 kappa opioid receptor (KOR)
Type:
G Protein-Coupled Receptor (GPCR)
Mol. Mass.:
42648.76
Organism:
Homo sapiens (Human)
Description:
P41145
Residue:
380
  
Inhibitor
Name:
BDBM54800
Synonyms:
2-[1-[(E)-1-(2-furanyl)-3-(4-methoxyphenyl)-3-oxoprop-1-en-2-yl]-2-pyridinylidene]propanedinitrile 2-[1-[(E)-1-(furan-2-yl)-3-(4-methoxyphenyl)-3-oxoprop-1-en-2-yl]pyridin-2-ylidene]propanedinitrile 2-{1-[2-Furan-2-yl-1-(4-methoxy-benzoyl)-vinyl]-1H-pyridin-2-ylidene}-malononitrile SMR000176548 | cid_5761997
Type:
Small organic molecule
Emp. Form.:
C22H15N3O3
Mol. Mass.:
369.3728
SMILES:
COc1ccc(cc1)C(=O)C(=C/c1ccco1)\N1C=CC=CC1=C(C#N)C#N
: