Target
Kappa-type opioid receptor
Ligand
BDBM54803
Substrate
Meas. Tech.
HTS Image-Based Screen for Selective Antagonists of the KOR Receptor
IC50
630±58.2 nM
Citation
 PubChem, PC HTS Image-Based Screen for Selective Antagonists of the KOR Receptor PubChem Bioassay (2009)[AID] 
Target
Name:
Kappa-type opioid receptor
Synonyms:
K-OR-1 Kappa-opioid receptor (KOR) Kappa-type opioid receptor (KOR) OPIATE Kappa OPRK1 kappa opioid receptor (KOR)
Type:
G Protein-Coupled Receptor (GPCR)
Mol. Mass.:
42648.76
Organism:
Homo sapiens (Human)
Description:
P41145
Residue:
380
  
Inhibitor
Name:
BDBM54803
Synonyms:
(phenylmethyl) N-[2,2,2-tris(chloranyl)-1-[[2,4,6-tris(chloranyl)phenyl]carbamothioylamino]ethyl]carbamate N-[2,2,2-trichloro-1-[(2,4,6-trichlorophenyl)thiocarbamoylamino]ethyl]carbamic acid benzyl ester SMR000173876 cid_3091267 | {2,2,2-Trichloro-1-[3-(2,4,6-trichloro-phenyl)-thioureido]-ethyl}-carbamic acid benzyl ester
Type:
Small organic molecule
Emp. Form.:
C17H13Cl6N3O2S
Mol. Mass.:
536.087
SMILES:
Clc1cc(Cl)c(NC(=S)NC(NC(=O)OCc2ccccc2)C(Cl)(Cl)Cl)c(Cl)c1
: