Target
Kappa-type opioid receptor
Ligand
BDBM53797
Substrate
Meas. Tech.
HTS Image-Based Screen for Selective Antagonists of the KOR Receptor
IC50
18935±1570 nM
Citation
 PubChem, PC HTS Image-Based Screen for Selective Antagonists of the KOR Receptor PubChem Bioassay (2009)[AID] 
Target
Name:
Kappa-type opioid receptor
Synonyms:
K-OR-1 Kappa-opioid receptor (KOR) Kappa-type opioid receptor (KOR) OPIATE Kappa OPRK1 kappa opioid receptor (KOR)
Type:
G Protein-Coupled Receptor (GPCR)
Mol. Mass.:
42648.76
Organism:
Homo sapiens (Human)
Description:
P41145
Residue:
380
  
Inhibitor
Name:
BDBM53797
Synonyms:
2-[1-[(Z)-1-(2-furanyl)-3-oxo-3-phenylprop-1-en-2-yl]-2-pyridinylidene]propanedinitrile 2-[1-[(Z)-1-(furan-2-yl)-3-oxo-3-phenylprop-1-en-2-yl]pyridin-2-ylidene]propanedinitrile MLS000589523 cid_6374709
Type:
Small organic molecule
Emp. Form.:
C21H13N3O2
Mol. Mass.:
339.3468
SMILES:
O=C(\C(=C\c1ccco1)N1C=CC=CC1=C(C#N)C#N)c1ccccc1
: