Target
Kappa-type opioid receptor
Ligand
BDBM54834
Substrate
Meas. Tech.
HTS Image-Based Screen for Selective Antagonists of the KOR Receptor
IC50
>32000±2340 nM
Citation
 PubChem, PC HTS Image-Based Screen for Selective Antagonists of the KOR Receptor PubChem Bioassay (2009)[AID] 
Target
Name:
Kappa-type opioid receptor
Synonyms:
K-OR-1 Kappa-opioid receptor (KOR) Kappa-type opioid receptor (KOR) OPIATE Kappa OPRK1 kappa opioid receptor (KOR)
Type:
G Protein-Coupled Receptor (GPCR)
Mol. Mass.:
42648.76
Organism:
Homo sapiens (Human)
Description:
P41145
Residue:
380
  
Inhibitor
Name:
BDBM54834
Synonyms:
(3-asaryl-1-methyl-propyl)-(3,3-diphenylpropyl)amine;hydrochloride N-(3,3-diphenylpropyl)-4-(2,4,5-trimethoxyphenyl)-2-butanamine;hydrochloride SMR000538752 | cid_24747640
Type:
Small organic molecule
Emp. Form.:
C28H35NO3
Mol. Mass.:
433.5824
SMILES:
COc1cc(OC)c(OC)cc1CCC(C)NCCC(c1ccccc1)c1ccccc1
: