Target
Kappa-type opioid receptor
Ligand
BDBM54842
Substrate
Meas. Tech.
HTS Image-Based Screen for Selective Antagonists of the KOR Receptor
IC50
1323±86.4 nM
Citation
 PubChem, PC HTS Image-Based Screen for Selective Antagonists of the KOR Receptor PubChem Bioassay (2009)[AID] 
Target
Name:
Kappa-type opioid receptor
Synonyms:
K-OR-1 Kappa-opioid receptor (KOR) Kappa-type opioid receptor (KOR) OPIATE Kappa OPRK1 kappa opioid receptor (KOR)
Type:
G Protein-Coupled Receptor (GPCR)
Mol. Mass.:
42648.76
Organism:
Homo sapiens (Human)
Description:
P41145
Residue:
380
  
Inhibitor
Name:
BDBM54842
Synonyms:
MLS001123392 cid_22553442
Type:
Small organic molecule
Emp. Form.:
C26H30N6O3
Mol. Mass.:
474.5548
SMILES:
COc1ccc(cc1)N1CCN(CCCNC(=O)Cn2c3ncccc3n3cccc3c2=O)CC1
: