Target
Streptokinase A
Ligand
BDBM54888
Substrate
Meas. Tech.
Absorbance Microorganism-Based Dose Response Followup to Identify Inhibitors of Streptokinase Expression
EC50
4400±1172 nM
Citation
 PubChem, PC Absorbance Microorganism-Based Dose Response Followup to Identify Inhibitors of Streptokinase Expression PubChem Bioassay (2009)[AID] 
Target
Name:
Streptokinase A
Synonyms:
STRP_STRP1 streptokinase A precursor
Type:
Enzyme Catalytic Domain
Mol. Mass.:
49924.80
Organism:
Streptococcus pyogenes M1 GAS
Description:
gi_15675770
Residue:
440
  
Inhibitor
Name:
BDBM54888
Synonyms:
4-[4-allyl-5-[(3-methylbenzyl)thio]-1,2,4-triazol-3-yl]-2-[3-methyl-5-(trifluoromethyl)pyrazol-1-yl]thiazole 4-[5-[(3-methylphenyl)methylthio]-4-prop-2-enyl-1,2,4-triazol-3-yl]-2-[3-methyl-5-(trifluoromethyl)-1-pyrazolyl]thiazole cid_3754375
Type:
Small organic molecule
Emp. Form.:
C21H19F3N6S2
Mol. Mass.:
476.541
SMILES:
Cc1cc(n(n1)-c1nc(cs1)-c1nnc(SCc2cccc(C)c2)n1CC=C)C(F)(F)F
: