Target
Streptokinase A
Ligand
BDBM50219212
Substrate
Meas. Tech.
Absorbance Microorganism-Based Dose Response Followup to Identify Inhibitors of Streptokinase Expression
EC50
46541±1300 nM
Citation
 PubChem, PC Absorbance Microorganism-Based Dose Response Followup to Identify Inhibitors of Streptokinase Expression PubChem Bioassay (2009)[AID] 
Target
Name:
Streptokinase A
Synonyms:
STRP_STRP1 streptokinase A precursor
Type:
Enzyme Catalytic Domain
Mol. Mass.:
49924.80
Organism:
Streptococcus pyogenes M1 GAS
Description:
gi_15675770
Residue:
440
  
Inhibitor
Name:
BDBM50219212
Synonyms:
(10H-phenothiazin-10-yl)(p-tolyl)methanone cid_3473393
Type:
Small organic molecule
Emp. Form.:
C20H15NOS
Mol. Mass.:
317.404
SMILES:
Cc1ccc(cc1)C(=O)N1c2ccccc2Sc2ccccc12
: