Target
Tyrosine-protein phosphatase non-receptor type 22
Ligand
BDBM46237
Substrate
Meas. Tech.
SAR LYP1 Fluorescent Assay using OMFP substrate for In Vitro dose response studies
IC50
7461±n/a nM
Citation
 PubChem, PC SAR LYP1 Fluorescent Assay using OMFP substrate for In Vitro dose response studies PubChem Bioassay (2009)[AID] 
Target
Name:
Tyrosine-protein phosphatase non-receptor type 22
Synonyms:
3.1.3.48 LyP Lymphoid phosphatase (Lyp) PEST-domain phosphatase PTPN22 Tyrosine-protein phosphatase non-receptor type 22 (LYP) | tyrosine-protein phosphatase non-receptor type 22 isoform 1
Type:
Mol. Mass.:
91712.31
Organism:
Homo sapiens (Human)
Description:
Q9Y2R2
Residue:
807
  
Inhibitor
Name:
BDBM46237
Synonyms:
4-[3-[(5Z)-4-keto-2-thioxo-5-veratrylidene-thiazolidin-3-yl]propanoylamino]benzoic acid 4-[3-[(5Z)-5-[(3,4-dimethoxyphenyl)methylidene]-4-oxo-2-sulfanylidene-1,3-thiazolidin-3-yl]propanoylamino]benzoic acid MLS-0329775.0001 | cid_1587127
Type:
Small organic molecule
Emp. Form.:
C22H20N2O6S2
Mol. Mass.:
472.534
SMILES:
COc1ccc(\C=C2/SC(=S)N(CCC(=O)Nc3ccc(cc3)C(O)=O)C2=O)cc1OC
: