Target
Plectin
Ligand
BDBM44453
Substrate
Meas. Tech.
HTS TR-FRET-based dose response confirmatory assay for Siah-1
IC50
6447.776±1770 nM
Citation
 PubChem, PC HTS TR-FRET-based dose response confirmatory assay for Siah-1 PubChem Bioassay (2009)[AID] 
Target
Name:
Plectin
Synonyms:
PLEC PLEC_HUMAN | plectin 1
Type:
Enzyme Catalytic Domain
Mol. Mass.:
531740.96
Organism:
Homo sapiens (Human)
Description:
Q15149
Residue:
4684
  
Inhibitor
Name:
BDBM44453
Synonyms:
MLS000102133 N-[(1,2-dimethylindol-5-yl)methyl]-4-piperidin-1-ylsulfonyl-benzamide N-[(1,2-dimethylindol-5-yl)methyl]-4-piperidinosulfonyl-benzamide cid_5101991
Type:
Small organic molecule
Emp. Form.:
C23H27N3O3S
Mol. Mass.:
425.544
SMILES:
Cc1cc2cc(CNC(=O)c3ccc(cc3)S(=O)(=O)N3CCCCC3)ccc2n1C
: