Target
Plectin
Ligand
BDBM50919
Substrate
Meas. Tech.
HTS TR-FRET-based dose response confirmatory assay for Siah-1
IC50
10582±2189 nM
Citation
 PubChem, PC HTS TR-FRET-based dose response confirmatory assay for Siah-1 PubChem Bioassay (2009)[AID] 
Target
Name:
Plectin
Synonyms:
PLEC PLEC_HUMAN | plectin 1
Type:
Enzyme Catalytic Domain
Mol. Mass.:
531740.96
Organism:
Homo sapiens (Human)
Description:
Q15149
Residue:
4684
  
Inhibitor
Name:
BDBM50919
Synonyms:
2-methoxyethyl 4-amino-3-(2-methoxyethyl)-2-sulfanylidene-1,3-thiazole-5-carboxylate 4-amino-3-(2-methoxyethyl)-2-sulfanylidene-5-thiazolecarboxylic acid 2-methoxyethyl ester MLS000565318 cid_2402693
Type:
Small organic molecule
Emp. Form.:
C10H16N2O4S2
Mol. Mass.:
292.375
SMILES:
COCCOC(=O)c1sc(=S)n(CCOC)c1N
: