Target
Plectin
Ligand
BDBM54910
Substrate
Meas. Tech.
HTS TR-FRET-based dose response confirmatory assay for Siah-1
IC50
1792.264±412 nM
Citation
 PubChem, PC HTS TR-FRET-based dose response confirmatory assay for Siah-1 PubChem Bioassay (2009)[AID] 
Target
Name:
Plectin
Synonyms:
PLEC PLEC_HUMAN | plectin 1
Type:
Enzyme Catalytic Domain
Mol. Mass.:
531740.96
Organism:
Homo sapiens (Human)
Description:
Q15149
Residue:
4684
  
Inhibitor
Name:
BDBM54910
Synonyms:
2-thiophenecarboxylic acid [4-[[[(3-fluorophenyl)-oxomethyl]hydrazinylidene]methyl]phenyl] ester MLS000576933 [4-[[(3-fluorobenzoyl)hydrazinylidene]methyl]phenyl] thiophene-2-carboxylate cid_1378677 | thiophene-2-carboxylic acid [4-[[(3-fluorobenzoyl)hydrazono]methyl]phenyl] ester
Type:
Small organic molecule
Emp. Form.:
C19H13FN2O3S
Mol. Mass.:
368.382
SMILES:
Fc1cccc(c1)C(=O)NN=Cc1ccc(OC(=O)c2cccs2)cc1
: