Target
Plectin
Ligand
BDBM54917
Substrate
Meas. Tech.
HTS TR-FRET-based dose response confirmatory assay for Siah-1
IC50
14893.61±2110 nM
Citation
 PubChem, PC HTS TR-FRET-based dose response confirmatory assay for Siah-1 PubChem Bioassay (2009)[AID] 
Target
Name:
Plectin
Synonyms:
PLEC PLEC_HUMAN | plectin 1
Type:
Enzyme Catalytic Domain
Mol. Mass.:
531740.96
Organism:
Homo sapiens (Human)
Description:
Q15149
Residue:
4684
  
Inhibitor
Name:
BDBM54917
Synonyms:
4-[(3-chloranyl-1-benzothiophen-2-yl)methylideneamino]phenol 4-[(3-chlorobenzothiophen-2-yl)methyleneamino]phenol MLS000587840 cid_625522
Type:
Small organic molecule
Emp. Form.:
C15H10ClNOS
Mol. Mass.:
287.764
SMILES:
Oc1ccc(cc1)\N=C\c1sc2ccccc2c1Cl
: