Target
Plectin
Ligand
BDBM54771
Substrate
Meas. Tech.
HTS TR-FRET-based dose response confirmatory assay for Siah-1
IC50
3958.075±1340 nM
Citation
 PubChem, PC HTS TR-FRET-based dose response confirmatory assay for Siah-1 PubChem Bioassay (2009)[AID] 
Target
Name:
Plectin
Synonyms:
PLEC PLEC_HUMAN | plectin 1
Type:
Enzyme Catalytic Domain
Mol. Mass.:
531740.96
Organism:
Homo sapiens (Human)
Description:
Q15149
Residue:
4684
  
Inhibitor
Name:
BDBM54771
Synonyms:
3-amino-4-(ethylamino)benzoic acid MLS000402290 cid_854428
Type:
Small organic molecule
Emp. Form.:
C9H12N2O2
Mol. Mass.:
180.2038
SMILES:
CCNc1ccc(cc1N)C(O)=O
: