Target
Plectin
Ligand
BDBM54923
Substrate
Meas. Tech.
HTS TR-FRET-based dose response confirmatory assay for Siah-1
IC50
9925.446±3690 nM
Citation
 PubChem, PC HTS TR-FRET-based dose response confirmatory assay for Siah-1 PubChem Bioassay (2009)[AID] 
Target
Name:
Plectin
Synonyms:
PLEC PLEC_HUMAN | plectin 1
Type:
Enzyme Catalytic Domain
Mol. Mass.:
531740.96
Organism:
Homo sapiens (Human)
Description:
Q15149
Residue:
4684
  
Inhibitor
Name:
BDBM54923
Synonyms:
4-acetyl-N-[4-(3-methyl-[1,2,4]triazolo[4,3-b]pyridazin-6-yl)phenyl]benzenesulfonamide MLS000684994 cid_7161231
Type:
Small organic molecule
Emp. Form.:
C20H17N5O3S
Mol. Mass.:
407.446
SMILES:
CC(=O)c1ccc(cc1)S(=O)(=O)Nc1ccc(cc1)-c1ccc2nnc(C)n2n1
: