Target
Plectin
Ligand
BDBM54925
Substrate
Meas. Tech.
HTS TR-FRET-based dose response confirmatory assay for Siah-1
IC50
7292.408±3520 nM
Citation
 PubChem, PC HTS TR-FRET-based dose response confirmatory assay for Siah-1 PubChem Bioassay (2009)[AID] 
Target
Name:
Plectin
Synonyms:
PLEC PLEC_HUMAN | plectin 1
Type:
Enzyme Catalytic Domain
Mol. Mass.:
531740.96
Organism:
Homo sapiens (Human)
Description:
Q15149
Residue:
4684
  
Inhibitor
Name:
BDBM54925
Synonyms:
MLS000708868 N-(2-furfuryl)-2-(4-keto-5-phenyl-thieno[2,3-d]pyrimidin-3-yl)acetamide N-(furan-2-ylmethyl)-2-(4-oxo-5-phenylthieno[2,3-d]pyrimidin-3-yl)acetamide cid_1167199
Type:
Small organic molecule
Emp. Form.:
C19H15N3O3S
Mol. Mass.:
365.406
SMILES:
O=C(Cn1cnc2scc(-c3ccccc3)c2c1=O)NCc1ccco1
: