Target
Plectin
Ligand
BDBM54948
Substrate
Meas. Tech.
HTS TR-FRET-based dose response confirmatory assay for Siah-1
IC50
4032.172±1250 nM
Citation
 PubChem, PC HTS TR-FRET-based dose response confirmatory assay for Siah-1 PubChem Bioassay (2009)[AID] 
Target
Name:
Plectin
Synonyms:
PLEC PLEC_HUMAN | plectin 1
Type:
Enzyme Catalytic Domain
Mol. Mass.:
531740.96
Organism:
Homo sapiens (Human)
Description:
Q15149
Residue:
4684
  
Inhibitor
Name:
BDBM54948
Synonyms:
5-[(5E)-5-(3,4-dibenzoxybenzylidene)-4-keto-2-thioxo-thiazolidin-3-yl]valeric acid 5-[(5E)-5-[[3,4-bis(phenylmethoxy)phenyl]methylidene]-4-oxo-2-sulfanylidene-1,3-thiazolidin-3-yl]pentanoic acid MLS001143010 cid_24683760
Type:
Small organic molecule
Emp. Form.:
C29H27NO5S2
Mol. Mass.:
533.658
SMILES:
OC(=O)CCCCN1C(=S)S\C(=C\c2ccc(OCc3ccccc3)c(OCc3ccccc3)c2)C1=O
: