Target
Core protein
Ligand
BDBM48611
Substrate
Meas. Tech.
TR-FRET-based biochemical high-throughput dose response assay to identify inhibitors of Hepatitis C Virus (HCV) core protein dimerization.
IC50
>49751±n/a nM
Citation
 PubChem, PC TR-FRET-based biochemical high-throughput dose response assay to identify inhibitors of Hepatitis C Virus (HCV) core protein dimerization. PubChem Bioassay (2009)[AID] 
Target
Name:
Core protein
Synonyms:
Type:
Enzyme Catalytic Domain
Mol. Mass.:
14237.71
Organism:
Hepatitis C virus
Description:
gi_83779224
Residue:
126
  
Inhibitor
Name:
BDBM48611
Synonyms:
2-(2-thienyl)-N-(5-veratryl-1,3,4-thiadiazol-2-yl)acetamide N-[5-(3,4-Dimethoxy-benzyl)-[1,3,4]thiadiazol-2-yl]-2-thiophen-2-yl-acetamide N-[5-[(3,4-dimethoxyphenyl)methyl]-1,3,4-thiadiazol-2-yl]-2-thiophen-2-ylacetamide cid_646403
Type:
Small organic molecule
Emp. Form.:
C17H17N3O3S2
Mol. Mass.:
375.465
SMILES:
COc1ccc(Cc2nnc(NC(=O)Cc3cccs3)s2)cc1OC
: