Target
Core protein
Ligand
BDBM54977
Substrate
Meas. Tech.
TR-FRET-based biochemical high-throughput dose response assay to identify inhibitors of Hepatitis C Virus (HCV) core protein dimerization.
IC50
>49751±n/a nM
Citation
 PubChem, PC TR-FRET-based biochemical high-throughput dose response assay to identify inhibitors of Hepatitis C Virus (HCV) core protein dimerization. PubChem Bioassay (2009)[AID] 
Target
Name:
Core protein
Synonyms:
Type:
Enzyme Catalytic Domain
Mol. Mass.:
14237.71
Organism:
Hepatitis C virus
Description:
gi_83779224
Residue:
126
  
Inhibitor
Name:
BDBM54977
Synonyms:
MLS000700239 [1]benzofuro[2',3':4,5]pyrrolo[1,2-d][1,2,4]triazine-4(3H)-thione | cid_7720817
Type:
Small organic molecule
Emp. Form.:
C12H7N3OS
Mol. Mass.:
241.268
SMILES:
S=c1[nH]ncn2c1cc1oc3ccccc3c21
: