Target
Core protein
Ligand
BDBM52890
Substrate
Meas. Tech.
TR-FRET-based biochemical high-throughput dose response assay to identify inhibitors of Hepatitis C Virus (HCV) core protein dimerization.
IC50
>49751±n/a nM
Citation
 PubChem, PC TR-FRET-based biochemical high-throughput dose response assay to identify inhibitors of Hepatitis C Virus (HCV) core protein dimerization. PubChem Bioassay (2009)[AID] 
Target
Name:
Core protein
Synonyms:
Type:
Enzyme Catalytic Domain
Mol. Mass.:
14237.71
Organism:
Hepatitis C virus
Description:
gi_83779224
Residue:
126
  
Inhibitor
Name:
BDBM52890
Synonyms:
CMLD003357 SMR000452591 [3-(4-methoxy-4-oxobutyl)-7-methyl-6,8-dioxoisochromen-7-yl] cyclopentanecarboxylate cyclopentanecarboxylic acid [3-(4-methoxy-4-oxobutyl)-7-methyl-6,8-dioxo-2-benzopyran-7-yl] ester | cyclopentanecarboxylic acid [6,8-diketo-3-(4-keto-4-methoxy-butyl)-7-methyl-isochromen-7-yl] ester
Type:
Small organic molecule
Emp. Form.:
C21H24O7
Mol. Mass.:
388.4111
SMILES:
COC(=O)CCCC1=CC2=CC(=O)C(C)(OC(=O)C3CCCC3)C(=O)C2=CO1
: