Target
Genome polyprotein
Ligand
BDBM50024
Substrate
Meas. Tech.
Fluorescence-based biochemical high throughput dose response assay for inhibitors of the Hepatitis C Virus non-structural protein 3 helicase (NS3).
IC50
26270±n/a nM
Citation
 PubChem, PC Fluorescence-based biochemical high throughput dose response assay for inhibitors of the Hepatitis C Virus non-structural protein 3 helicase (NS3). PubChem Bioassay (2009)[AID] 
Target
Name:
Genome polyprotein
Synonyms:
NS3
Type:
Enzyme Catalytic Domain
Mol. Mass.:
67067.41
Organism:
Hepatitis C virus
Description:
gi_125541954
Residue:
631
  
Inhibitor
Name:
BDBM50024
Synonyms:
MLS000098300 N-[4,5-bis(2-furyl)thiazol-2-yl]-1-(2,3-dihydro-1,4-benzodioxin-6-yl)-5-keto-pyrrolidine-3-carboxamide N-[4,5-bis(furan-2-yl)-1,3-thiazol-2-yl]-1-(2,3-dihydro-1,4-benzodioxin-6-yl)-5-oxopyrrolidine-3-carboxamide cid_2998894
Type:
Small organic molecule
Emp. Form.:
C24H19N3O6S
Mol. Mass.:
477.489
SMILES:
O=C(Nc1nc(-c2ccco2)c(s1)-c1ccco1)C1CN(C(=O)C1)c1ccc2OCCOc2c1
: