Target
Genome polyprotein
Ligand
BDBM33116
Substrate
Meas. Tech.
Fluorescence-based biochemical high throughput dose response assay for inhibitors of the Hepatitis C Virus non-structural protein 3 helicase (NS3).
IC50
41317±n/a nM
Citation
 PubChem, PC Fluorescence-based biochemical high throughput dose response assay for inhibitors of the Hepatitis C Virus non-structural protein 3 helicase (NS3). PubChem Bioassay (2009)[AID] 
Target
Name:
Genome polyprotein
Synonyms:
NS3
Type:
Enzyme Catalytic Domain
Mol. Mass.:
67067.41
Organism:
Hepatitis C virus
Description:
gi_125541954
Residue:
631
  
Inhibitor
Name:
BDBM33116
Synonyms:
(E)-3-(5-methyl-2-furanyl)-N-[3-[[(E)-3-(5-methyl-2-furanyl)-1-oxoprop-2-enyl]amino]-4-nitrophenyl]-2-propenamide (E)-3-(5-methylfuran-2-yl)-N-[3-[[(E)-3-(5-methylfuran-2-yl)prop-2-enoyl]amino]-4-nitro-phenyl]prop-2-enamide MLS000578867 SMR000197853 | cid_5736971
Type:
Small organic molecule
Emp. Form.:
C22H19N3O6
Mol. Mass.:
421.4028
SMILES:
Cc1ccc(\C=C\C(=O)Nc2ccc(c(NC(=O)\C=C\c3ccc(C)o3)c2)[N+]([O-])=O)o1
: