Target
Genome polyprotein
Ligand
BDBM48795
Substrate
Meas. Tech.
Fluorescence-based biochemical high throughput dose response assay for inhibitors of the Hepatitis C Virus non-structural protein 3 helicase (NS3).
IC50
6066±n/a nM
Citation
 PubChem, PC Fluorescence-based biochemical high throughput dose response assay for inhibitors of the Hepatitis C Virus non-structural protein 3 helicase (NS3). PubChem Bioassay (2009)[AID] 
Target
Name:
Genome polyprotein
Synonyms:
NS3
Type:
Enzyme Catalytic Domain
Mol. Mass.:
67067.41
Organism:
Hepatitis C virus
Description:
gi_125541954
Residue:
631
  
Inhibitor
Name:
BDBM48795
Synonyms:
4-(2-{[1-(3-chlorophenyl)-2,5-dioxo-4-imidazolidinylidene]methyl}-1H-pyrrol-1-yl)benzoic acid 4-[2-[(E)-[1-(3-chlorophenyl)-2,5-diketo-imidazolidin-4-ylidene]methyl]pyrrol-1-yl]benzoic acid 4-[2-[(E)-[1-(3-chlorophenyl)-2,5-dioxoimidazolidin-4-ylidene]methyl]pyrrol-1-yl]benzoic acid SMR000299427 | cid_1782309
Type:
Small organic molecule
Emp. Form.:
C21H14ClN3O4
Mol. Mass.:
407.807
SMILES:
OC(=O)c1ccc(cc1)-n1cccc1C=C1NC(=O)N(C1=O)c1cccc(Cl)c1
: