Target
Genome polyprotein
Ligand
BDBM55060
Substrate
Meas. Tech.
Fluorescence-based biochemical high throughput dose response assay for inhibitors of the Hepatitis C Virus non-structural protein 3 helicase (NS3).
IC50
45706±n/a nM
Citation
 PubChem, PC Fluorescence-based biochemical high throughput dose response assay for inhibitors of the Hepatitis C Virus non-structural protein 3 helicase (NS3). PubChem Bioassay (2009)[AID] 
Target
Name:
Genome polyprotein
Synonyms:
NS3
Type:
Enzyme Catalytic Domain
Mol. Mass.:
67067.41
Organism:
Hepatitis C virus
Description:
gi_125541954
Residue:
631
  
Inhibitor
Name:
BDBM55060
Synonyms:
4-(4-keto-8-methoxy-2-thioxo-1,5-dihydropyrimid[5,4-b]indol-3-yl)-N-(2-methylcyclohexyl)butyramide 4-(8-methoxy-4-oxo-2-sulfanylidene-1,5-dihydropyrimido[5,4-b]indol-3-yl)-N-(2-methylcyclohexyl)butanamide SMR000623811 | cid_24789575
Type:
Small organic molecule
Emp. Form.:
C22H28N4O3S
Mol. Mass.:
428.548
SMILES:
COc1ccc2[nH]c3c([nH]c(=S)n(CCCC(=O)NC4CCCCC4C)c3=O)c2c1
: