Target
Genome polyprotein
Ligand
BDBM55062
Substrate
Meas. Tech.
Fluorescence-based biochemical high throughput dose response assay for inhibitors of the Hepatitis C Virus non-structural protein 3 helicase (NS3).
IC50
6106±n/a nM
Citation
 PubChem, PC Fluorescence-based biochemical high throughput dose response assay for inhibitors of the Hepatitis C Virus non-structural protein 3 helicase (NS3). PubChem Bioassay (2009)[AID] 
Target
Name:
Genome polyprotein
Synonyms:
NS3
Type:
Enzyme Catalytic Domain
Mol. Mass.:
67067.41
Organism:
Hepatitis C virus
Description:
gi_125541954
Residue:
631
  
Inhibitor
Name:
BDBM55062
Synonyms:
3-(5-methylfuran-2-yl)carbonyl-4-oxidanyl-2-(3-phenoxyphenyl)-1-(pyridin-3-ylmethyl)-2H-pyrrol-5-one 4-hydroxy-3-(5-methylfuran-2-carbonyl)-2-(3-phenoxyphenyl)-1-(pyridin-3-ylmethyl)-2H-pyrrol-5-one MLS001083034 cid_2911077
Type:
Small organic molecule
Emp. Form.:
C28H22N2O5
Mol. Mass.:
466.4847
SMILES:
Cc1ccc(o1)C(=O)C1C(N(Cc2cccnc2)C(=O)C1=O)c1cccc(Oc2ccccc2)c1
: