Target
Genome polyprotein
Ligand
BDBM55079
Substrate
Meas. Tech.
Fluorescence-based biochemical high throughput dose response assay for inhibitors of the Hepatitis C Virus non-structural protein 3 helicase (NS3).
IC50
2493±n/a nM
Citation
 PubChem, PC Fluorescence-based biochemical high throughput dose response assay for inhibitors of the Hepatitis C Virus non-structural protein 3 helicase (NS3). PubChem Bioassay (2009)[AID] 
Target
Name:
Genome polyprotein
Synonyms:
NS3
Type:
Enzyme Catalytic Domain
Mol. Mass.:
67067.41
Organism:
Hepatitis C virus
Description:
gi_125541954
Residue:
631
  
Inhibitor
Name:
BDBM55079
Synonyms:
3-(1-benzofuran-2-carbonyl)-4-hydroxy-1-(5-methyl-1,2-oxazol-3-yl)-2-(4-methylphenyl)-2H-pyrrol-5-one 3-[2-benzofuranyl(oxo)methyl]-4-hydroxy-1-(5-methyl-3-isoxazolyl)-2-(4-methylphenyl)-2H-pyrrol-5-one MLS001147776 cid_3252667
Type:
Small organic molecule
Emp. Form.:
C24H18N2O5
Mol. Mass.:
414.4101
SMILES:
Cc1cc(no1)N1C(C(C(=O)c2cc3ccccc3o2)C(=O)C1=O)c1ccc(C)cc1
: