Target
Metabotropic glutamate receptor 7
Ligand
BDBM50293721
Substrate
Meas. Tech.
Modulation of the Metabotropic Glutamate Receptor mGluR4: Selectivity at mGluR7
EC50
445000±n/a nM
Citation
 PubChem, PC Modulation of the Metabotropic Glutamate Receptor mGluR4: Selectivity at mGluR7 PubChem Bioassay (2010)[AID] 
Target
Name:
Metabotropic glutamate receptor 7
Synonyms:
GRM7_RAT Grm7 Metabotropic glutamate receptor 7 (mGlu7) mGlu7
Type:
Enzyme
Mol. Mass.:
102244.48
Organism:
Rattus norvegicus (Rat)
Description:
P35400
Residue:
915
  
Inhibitor
Name:
BDBM50293721
Synonyms:
CHEMBL562551 cid_44191096
Type:
Small organic molecule
Emp. Form.:
C13H11ClN2O2
Mol. Mass.:
262.692
SMILES:
COc1cc(NC(=O)c2ccccn2)ccc1Cl
: